cancel
Showing results for 
Show  only  | Search instead for 
Did you mean: 
Announcements
Back again with another edition of 'How we use Dropbox', so find out how Emma uses to-do lists to get it all done here!

Dropbox API Support & Feedback

Find help with the Dropbox API from other developers.

cancel
Showing results for 
Show  only  | Search instead for 
Did you mean: 

Compilation error whren installing API

Compilation error whren installing API

Learner
Explorer | Level 3

Following dropbox ducomentation for compiling API seems some classes are missing:

DbxTeamClientV2Base, DbxClientV2Base and DbxAppClientV2Base and compilation ends with error.

Below  the detailed problem:

Starting a new Gradle Daemon for this build (subsequent builds will be faster).
Parallel execution with configuration on demand is an incubating feature.
Set JDK6_HOME environment to disable boot classpath warnings.
:generateStone UP-TO-DATE
:compileJava
warning: [options] bootstrap class path not set in conjunction with -source 1.6
/usr/local/AndroidProjects/dropbox-sdk-java-master/src/main/java/com/dropbox/core/v2/DbxTeamClientV2.java:24: error: cannot find symbol
public class DbxTeamClientV2 extends DbxTeamClientV2Base {
                                                                           ^
  symbol: class DbxTeamClientV2Base
/usr/local/AndroidProjects/dropbox-sdk-java-master/src/main/java/com/dropbox/core/v2/DbxClientV2.java:19: error: cannot find symbol
public class DbxClientV2 extends DbxClientV2Base {
                                                                 ^
  symbol: class DbxClientV2Base
/usr/local/AndroidProjects/dropbox-sdk-java-master/src/main/java/com/dropbox/core/v2/DbxAppClientV2.java:20: error: cannot find symbol
class DbxAppClientV2 extends DbxAppClientV2Base {
                                                            ^
  symbol: class DbxAppClientV2Base
3 errors
:compileJava FAILED

FAILURE: Build failed with an exception.

* What went wrong:
Execution failed for task ':compileJava'.
> Compilation failed; see the compiler error output for details.

* Try:
Run with --stacktrace option to get the stack trace. Run with --info or --debug option to get more log output.

BUILD FAILED

1 Reply 1

Re: Compilation error whren installing API

Greg-DB
Dropboxer
Poll
We love to learn from the educators who use Dropbox. Whether you teach kids, teens, adults or a combination of all three, we want to know what apps and integrations you use with Dropbox to help with teaching. Which of the ones below is your favorite, or most used tool?
Who's talking

Top contributors to this post

  • User avatar
    Greg-DB Dropboxer
What do Dropbox user levels mean?
Need more support?